More details on notebook

1 job for master in 2 minutes and 40 seconds (queued for 2 seconds)
Status Name Job ID Coverage
  Test
failed test #5973

00:02:40

 
Name Stage Failure
failed
test Test
----------------------------------------------
TOTAL 381 90 76%

=========================== short test summary info ============================
FAILED sdc/tests/test_client.py::test_search - AssertionError: assert 600 == 362
FAILED sdc/tests/test_client.py::test_fido_search - AssertionError: assert 50...
======= 2 failed, 34 passed, 3 xfailed, 6 warnings in 121.65s (0:02:01) ========
Cleaning up project directory and file based variables
ERROR: Job failed: exit code 1