Fetch with default filenames, expand obsrec into rows

1 job for fido-client in 4 minutes and 18 seconds (queued for 5 seconds)
Status Name Job ID Coverage
  Test
failed test #3818

00:04:18

 
Name Stage Failure
failed
test Test
----------------------------------------------
TOTAL 358 51 86%

=========================== short test summary info ============================
FAILED sdc/tests/test_client.py::test_search - AssertionError: assert 'INSTRU...
FAILED sdc/tests/test_client.py::test_fido_search - AssertionError: assert 'F...
======= 2 failed, 33 passed, 1 xfailed, 14 warnings in 91.63s (0:01:31) ========
Cleaning up file based variables
ERROR: Job failed: exit code 1