Fetch with default filenames, expand obsrec into rows

1 job for fido-client in 4 minutes (queued for 2 seconds)
Status Name Job ID Coverage
  Test
failed test #3820

00:04:00

 
Name Stage Failure
failed
test Test
TOTAL                        362     66    82%

=========================== short test summary info ============================
FAILED sdc/tests/test_client.py::test_search - AssertionError: assert 40 > 42
FAILED sdc/tests/test_client.py::test_fido_search - AssertionError: assert 'F...
FAILED sdc/tests/test_client.py::test_fido_fetch_2 - IndexError: only integer...
======= 3 failed, 32 passed, 1 xfailed, 14 warnings in 72.93s (0:01:12) ========
Cleaning up file based variables
ERROR: Job failed: exit code 1