Fetch with default filenames, expand obsrec into rows

1 job for fido-client in 3 minutes and 24 seconds (queued for 4 seconds)
Status Name Job ID Coverage
  Test
failed test #3821

00:03:24

 
Name Stage Failure
failed
test Test
TOTAL                        364     90    75%

=========================== short test summary info ============================
FAILED sdc/tests/test_client.py::test_fido_search - AssertionError: assert 'F...
FAILED sdc/tests/test_client.py::test_fido_fetch - AssertionError: assert False
FAILED sdc/tests/test_client.py::test_fido_fetch_2 - assert 2 == 301
============ 3 failed, 32 passed, 1 xfailed, 14 warnings in 39.74s =============
Cleaning up file based variables
ERROR: Job failed: exit code 1