Fetch with default filenames, expand obsrec into rows

1 job for fido-client in 3 minutes and 29 seconds (queued for 6 seconds)
Status Name Job ID Coverage
  Test
failed test #3822

00:03:29

 
Name Stage Failure
failed
test Test
----------------------------------------------
TOTAL 362 71 80%

=========================== short test summary info ============================
FAILED sdc/tests/test_client.py::test_fido_fetch - KeyError: 'OBS_NAME'
FAILED sdc/tests/test_client.py::test_fido_fetch_2 - AssertionError: assert '...
============ 2 failed, 33 passed, 1 xfailed, 14 warnings in 40.81s =============
Cleaning up file based variables
ERROR: Job failed: exit code 1