Fetch with default filenames, expand obsrec into rows

1 job for fido-client in 3 minutes and 28 seconds (queued for 1 second)
Status Name Job ID Coverage
  Test
failed test #3824

00:03:28

 
Name Stage Failure
failed
test Test
----------------------------------------------
TOTAL 358 80 78%

=========================== short test summary info ============================
FAILED sdc/tests/test_client.py::test_fido_fetch - NameError: name 'filespath...
FAILED sdc/tests/test_client.py::test_fido_fetch_2 - AssertionError: assert '...
============ 2 failed, 33 passed, 1 xfailed, 14 warnings in 40.68s =============
Cleaning up file based variables
ERROR: Job failed: exit code 1