Fetch with default filenames, expand obsrec into rows

1 job for fido-client in 3 minutes and 45 seconds (queued for 5 seconds)
Status Name Job ID Coverage
  Test
failed test #3827

00:03:45

 
Name Stage Failure
failed
test Test
----------------------------------------------
TOTAL 362 65 82%

=========================== short test summary info ============================
FAILED sdc/tests/test_client.py::test_fido_fetch - AssertionError: assert 'bb...
FAILED sdc/tests/test_client.py::test_fido_fetch_2 - AssertionError: assert '...
======= 2 failed, 33 passed, 1 xfailed, 14 warnings in 60.71s (0:01:00) ========
Cleaning up file based variables
ERROR: Job failed: exit code 1