Unpack obsrec description into Quantity columns

1 job for fido-client in 3 minutes and 16 seconds (queued for 3 seconds)
Status Name Job ID Coverage
  Test
failed test #3839

00:03:16

 
Name Stage Failure
failed
test Test
FAILED sdc/tests/test_client.py::test_all_queries[query13] - AssertionError: ...
FAILED sdc/tests/test_client.py::test_all_queries[query14] - AssertionError: ...
FAILED sdc/tests/test_client.py::test_all_queries[query18] - AssertionError: ...
FAILED sdc/tests/test_client.py::test_all_queries[query23] - AssertionError: ...
FAILED sdc/tests/test_client.py::test_range - KeyError: 'description'
FAILED sdc/tests/test_client.py::test_full_range - AssertionError: assert 'de...
============ 15 failed, 20 passed, 1 xfailed, 12 warnings in 27.86s ============
Cleaning up file based variables
ERROR: Job failed: exit code 1