Set data type and path to f"l{a.Level().value}_data"

1 job for fido-client in 4 minutes and 29 seconds (queued for 2 seconds)
Status Name Job ID Coverage
  Test
failed test #3881

00:04:29

 
Name Stage Failure
failed
test Test
TOTAL                        377     59    84%

=========================== short test summary info ============================
FAILED sdc/tests/test_client.py::test_level_data[level0] - assert 0 == 4
FAILED sdc/tests/test_client.py::test_level_data[level1] - AssertionError: as...
FAILED sdc/tests/test_client.py::test_level_data[level2] - assert 0 == 1
======= 3 failed, 35 passed, 1 xfailed, 15 warnings in 102.74s (0:01:42) =======
Cleaning up file based variables
ERROR: Job failed: exit code 1