Set data type and path to f"l{a.Level().value}_data"

1 job for fido-client in 3 minutes and 52 seconds (queued for 1 second)
Status Name Job ID Coverage
  Test
failed test #3882

00:03:52

 
Name Stage Failure
failed
test Test
TOTAL                        381     85    78%

=========================== short test summary info ============================
FAILED sdc/tests/test_client.py::test_fido_fetch_2 - ValueError: The truth va...
FAILED sdc/tests/test_client.py::test_level_data[level0] - assert 0 == 4
FAILED sdc/tests/test_client.py::test_level_data[level1] - AssertionError: as...
======= 3 failed, 34 passed, 2 xfailed, 15 warnings in 65.57s (0:01:05) ========
Cleaning up file based variables
ERROR: Job failed: exit code 1